Target
Fibroblast growth factor receptor 1
Ligand
BDBM286388
Substrate
Meas. Tech.
ChEBML_1664148
IC50
2.30±n/a nM
Citation
 Brameld, KAOwens, TDVerner, EVenetsanakos, EBradshaw, JMPhan, VTTam, DLeung, KShu, JLaStant, JLoughhead, DGTon, TKarr, DEGerritsen, MEGoldstein, DMFunk, JO Discovery of the Irreversible Covalent FGFR Inhibitor 8-(3-(4-Acryloylpiperazin-1-yl)propyl)-6-(2,6-dichloro-3,5-dimethoxyphenyl)-2-(methylamino)pyrido[2,3-d]pyrimidin-7(8H)-one (PRN1371) for the Treatment of Solid Tumors. J Med Chem 60:6516-6527 (2017)  
Target
Name:
Fibroblast growth factor receptor 1
Synonyms:
BFGFR Basic fibroblast growth factor receptor 1 (FGFR1) CEK FGFR-1 FGFR-1, (FL) FGFR1_HUMAN FLT2 Fibroblast growth factor receptor 1 (FGFR-1) Fms-like tyrosine kinase 2 N-sam bFGF-R | c-fgr
Type:
Receptor
Mol. Mass.:
91861.70
Organism:
Homo sapiens (Human)
Description:
P11362
Residue:
822
  
Inhibitor
Name:
BDBM286388
Synonyms:
8-(2-(4-acryloylpiperazin-1-yl)ethyl)-6-(2,6-dichloro-3,5-dimethoxyphenyl)-2-(methylamino)pyrido[2,3-d]pyrimidin-7(8H)-one US11078199, Cpd 2 US9815834, Compound 2
Type:
Small organic molecule
Emp. Form.:
C25H28Cl2N6O4
Mol. Mass.:
547.434
SMILES:
CNc1ncc2cc(-c3c(Cl)c(OC)cc(OC)c3Cl)c(=O)n(CCN3CCN(CC3)C(=O)C=C)c2n1
: