Target
Tyrosine-protein kinase JAK1
Ligand
BDBM198272
Substrate
Meas. Tech.
Enzyme Assay
Temperature
298.15±n/a K
IC50
0.400±n/a nM
Comments
extracted
Citation
 Hayashi, KWatanabe, TToyama, KKamon, JMinami, MUni, MNasu, M Substituted pyrrolo[3′,2′:5,6]pyrido[4,3-d]pyrimidines and JAK inhibitors comprising the same US Patent  US9556187 Publication Date 1/31/2017 
Target
Name:
Tyrosine-protein kinase JAK1
Synonyms:
JAK-1 JAK1A JAK1_HUMAN Janus kinase 1 (JAK1) | Janus kinase 1 JAK1
Type:
Protein
Mol. Mass.:
133293.73
Organism:
Homo sapiens (Human)
Description:
P23458
Residue:
1154
  
Inhibitor
Name:
BDBM198272
Synonyms:
US9216999, 79 | US9556187, Example 79
Type:
Small organic molecule
Emp. Form.:
C14H15F2N5
Mol. Mass.:
291.2992
SMILES:
FC(F)[C@H]1CC[C@@H](CC1)c1nnn2cnc3[nH]ccc3c12
: