Target
P2X purinoceptor 4
Ligand
BDBM85043
Substrate
Ki
500±n/a nM
Comments
PDSP_3582
Citation
 Garcia-Guzman, MSoto, FGomez-Hernandez, JMLund, PEStühmer, W Characterization of recombinant human P2X4 receptor reveals pharmacological differences to the rat homologue. Mol Pharmacol 51:109-18 (1997)  
Target
Name:
P2X purinoceptor 4
Synonyms:
P2RX4_RAT Purinergic, P2X4
Type:
Enzyme Catalytic Domain
Mol. Mass.:
43504.16
Organism:
RAT
Description:
Purinergic, P2X4 0 RAT::P51577
Residue:
388
  
Inhibitor
Name:
BDBM85043
Synonyms:
CAS_149017-66-3 NSC_6093163 | PPADS
Type:
Small organic molecule
Emp. Form.:
C14H14N3O12PS2
Mol. Mass.:
511.378
SMILES:
Cc1nc(N=Nc2ccc(cc2S(O)(=O)=O)S(O)(=O)=O)c(COP(O)(O)=O)c(C=O)c1O
: