Target
Metabotropic glutamate receptor 6
Ligand
BDBM82355
Substrate
Ki
>10000±n/a nM
Comments
PDSP_3205
Citation
 Conn, PJPin, JP Pharmacology and functions of metabotropic glutamate receptors. Annu Rev Pharmacol Toxicol 37:205-37 (1997)  
Target
Name:
Metabotropic glutamate receptor 6
Synonyms:
GPRC1F GRM6_HUMAN Metabotropic glutamate receptor 6 metabotropic glutamate 6
Type:
Enzyme Catalytic Domain
Mol. Mass.:
95479.26
Organism:
Homo sapiens (Human)
Description:
metabotropic glutamate 6 GRM6 HUMAN::O15303
Residue:
877
  
Inhibitor
Name:
BDBM82355
Synonyms:
Amino-(3-hydroxy-isoxazol-5-yl)-acetic acid(Ibotenic acid) CHEMBL284895 Ibotenic acid | NSC_1233
Type:
Small organic molecule
Emp. Form.:
C5H6N2O4
Mol. Mass.:
158.1121
SMILES:
NC(C(O)=O)c1cc(=O)[nH]o1
: