Target
Metabotropic glutamate receptor 7
Ligand
BDBM50004051
Substrate
Ki
>10000±n/a nM
Comments
PDSP_2029
Citation
 Conn, PJPin, JP Pharmacology and functions of metabotropic glutamate receptors. Annu Rev Pharmacol Toxicol 37:205-37 (1997)  
Target
Name:
Metabotropic glutamate receptor 7
Synonyms:
GPRC1G GRM7 protein MGLUR7 metabotropic glutamate 7
Type:
Enzyme Catalytic Domain
Mol. Mass.:
102262.98
Organism:
Homo sapiens (Human)
Description:
Q14831
Residue:
915
  
Inhibitor
Name:
BDBM50004051
Synonyms:
2-Amino-4-phosphono-butyric acid 4-Amino Phosphonobutyrate GlcN-6-P synthase inhibitor, 1 (racemic mixture) | L-AP4
Type:
Small organic molecule
Emp. Form.:
C4H10NO5P
Mol. Mass.:
183.0997
SMILES:
NC(CCP(O)(O)=O)C(O)=O
: