Target
Metabotropic glutamate receptor 7
Ligand
BDBM17664
Substrate
Ki
>10000±n/a nM
Comments
PDSP_3212
Citation
 Conn, PJPin, JP Pharmacology and functions of metabotropic glutamate receptors. Annu Rev Pharmacol Toxicol 37:205-37 (1997)  
Target
Name:
Metabotropic glutamate receptor 7
Synonyms:
GPRC1G GRM7 protein MGLUR7 metabotropic glutamate 7
Type:
Enzyme Catalytic Domain
Mol. Mass.:
102262.98
Organism:
Homo sapiens (Human)
Description:
Q14831
Residue:
915
  
Inhibitor
Name:
BDBM17664
Synonyms:
(2S)-2-amino-3-(phosphonooxy)propanoic acid L-SOP | L-serine O-phosphate
Type:
Small organic molecule
Emp. Form.:
C3H8NO6P
Mol. Mass.:
185.0725
SMILES:
N[C@@H](COP(O)(O)=O)C(O)=O
: