Target
D(4) dopamine receptor
Ligand
BDBM85091
Substrate
Ki
8.8±n/a nM
Comments
PDSP_737
Citation
 Newman-Tancredi, AAudinot, VChaput, CVerrièle, LMillan, MJ [35S]Guanosine-5'-O-(3-thio)triphosphate binding as a measure of efficacy at human recombinant dopamine D4.4 receptors: actions of antiparkinsonian and antipsychotic agents. J Pharmacol Exp Ther 282:181-91 (1997) Target
Name:
D(4) dopamine receptor
Synonyms:
D(2C) dopamine receptor DOPAMINE D4.2 DRD4 Dopamine D4 receptor
Type:
Enzyme
Mol. Mass.:
48373.19
Organism:
Homo sapiens (Human)
Description:
P21917
Residue:
419
  
Inhibitor
Name:
BDBM85091
Synonyms:
(+/-)-2-DIPROPYLAMINO- 6,7-DIHYDROXY-1,2,3,4-TETRAHYDRONAPHTHALENE CAS_62421-17-4 dp-ADTN
Type:
Small organic molecule
Emp. Form.:
C16H25NO2
Mol. Mass.:
263.3752
SMILES:
CCCN(CCC)C1CCc2cc(O)c(O)cc2C1
: