Target
D(4) dopamine receptor
Ligand
BDBM4377
Substrate
Ki
>10000±n/a nM
Comments
PDSP_1062
Citation
 Newman-Tancredi, AAudinot, VChaput, CVerrièle, LMillan, MJ [35S]Guanosine-5'-O-(3-thio)triphosphate binding as a measure of efficacy at human recombinant dopamine D4.4 receptors: actions of antiparkinsonian and antipsychotic agents. J Pharmacol Exp Ther 282:181-91 (1997) Target
Name:
D(4) dopamine receptor
Synonyms:
D(2C) dopamine receptor DOPAMINE D4.2 DRD4 Dopamine D4 receptor
Type:
Enzyme
Mol. Mass.:
48373.19
Organism:
Homo sapiens (Human)
Description:
P21917
Residue:
419
  
Inhibitor
Name:
BDBM4377
Synonyms:
2-amino-3-(3,4-dihydroxyphenyl)propanoic acid L-DOPA
Type:
Small organic molecule
Emp. Form.:
C9H11NO4
Mol. Mass.:
197.1879
SMILES:
NC(Cc1ccc(O)c(O)c1)C(O)=O
: