Target
D(4) dopamine receptor
Ligand
BDBM85092
Substrate
Ki
315±n/a nM
Comments
PDSP_1504
Citation
 Newman-Tancredi, AAudinot, VChaput, CVerrièle, LMillan, MJ [35S]Guanosine-5'-O-(3-thio)triphosphate binding as a measure of efficacy at human recombinant dopamine D4.4 receptors: actions of antiparkinsonian and antipsychotic agents. J Pharmacol Exp Ther 282:181-91 (1997) Target
Name:
D(4) dopamine receptor
Synonyms:
D(2C) dopamine receptor DOPAMINE D4.2 DRD4 Dopamine D4 receptor
Type:
Enzyme
Mol. Mass.:
48373.19
Organism:
Homo sapiens (Human)
Description:
P21917
Residue:
419
  
Inhibitor
Name:
BDBM85092
Synonyms:
CAS_3605-01-4 Piribedil
Type:
Small organic molecule
Emp. Form.:
C16H18N4O2
Mol. Mass.:
298.3397
SMILES:
C(N1CCN(CC1)c1ncccn1)c1ccc2OCOc2c1
: