Target
Alkaline phosphatase, tissue-nonspecific isozyme
Ligand
BDBM275103
Substrate
Meas. Tech.
TNAP Inhibition Activity
Temperature
298.15±n/a K
IC50
14.6±n/a nM
Comments
extracted
Citation
 Miyazaki, SYamamoto, YSuzuki, KInui, MIzumi, MSoma, KPinkerton, AShinozaki, T Pyridine compounds US Patent  US9879032 Publication Date 1/30/2018 
Target
Name:
Alkaline phosphatase, tissue-nonspecific isozyme
Synonyms:
ALPL tissue-nonspecific alkaline phosphatase precursor
Type:
PROTEIN
Mol. Mass.:
57306.17
Organism:
Homo sapiens (Human)
Description:
ChEMBL_1448917
Residue:
524
  
Inhibitor
Name:
BDBM275103
Synonyms:
US10221195, Example 45 | US9879032, Example 45
Type:
Small organic molecule
Emp. Form.:
C18H19ClN4O6S
Mol. Mass.:
454.885
SMILES:
COc1ccc(Cl)cc1S(=O)(=O)Nc1cnc2OCC(NC(=O)c2c1)C(=O)N(C)C
: