Target
Prostaglandin E2 receptor EP4 subtype
Ligand
BDBM85177
Substrate
Ki
500±n/a nM
Comments
PDSP_1159
Citation
 Kiriyama, MUshikubi, FKobayashi, THirata, MSugimoto, YNarumiya, S Ligand binding specificities of the eight types and subtypes of the mouse prostanoid receptors expressed in Chinese hamster ovary cells. Br J Pharmacol 122:217-24 (1997)  
Target
Name:
Prostaglandin E2 receptor EP4 subtype
Synonyms:
PE2R4_MOUSE Prostanoid EP4 receptor Ptgerep4
Type:
G-protein coupled receptor
Mol. Mass.:
56175.66
Organism:
Mus musculus (Mouse)
Description:
Residue:
513
  
Inhibitor
Name:
BDBM85177
Synonyms:
CAS_80558-61-8 NSC_119139
Type:
Small organic molecule
Emp. Form.:
C22H30O5
Mol. Mass.:
374.4706
SMILES:
OC(COc1ccccc1)C=CC1CCC(=O)C1CCCCCCC(O)=O
: