Target
Prostacyclin receptor
Ligand
BDBM85186
Substrate
Ki
15±n/a nM
Comments
PDSP_988
Citation
 Kiriyama, MUshikubi, FKobayashi, THirata, MSugimoto, YNarumiya, S Ligand binding specificities of the eight types and subtypes of the mouse prostanoid receptors expressed in Chinese hamster ovary cells. Br J Pharmacol 122:217-24 (1997)  
Target
Name:
Prostacyclin receptor
Synonyms:
PI2R_MOUSE Prostaglandin I Ptgir
Type:
Enzyme Catalytic Domain
Mol. Mass.:
44475.65
Organism:
MOUSE
Description:
Prostaglandin I2 PTGIR MOUSE::P43252
Residue:
415
  
Inhibitor
Name:
BDBM85186
Synonyms:
CAS_5311244 NSC_5311244
Type:
Small organic molecule
Emp. Form.:
C21H34O4
Mol. Mass.:
350.4923
SMILES:
CCCCCC(O)C=CC1C(O)CC2C=C(CCCCC(O)=O)CC12
: