Target
Mitogen-activated protein kinase 1
Ligand
BDBM275228
Substrate
Meas. Tech.
IMAP-FP Assay
IC50
57±n/a nM
Citation
 Siliphaivanh, PMethot, JLipford, KAMolinari, DSloman, DLWitter, DZhou, HBoyce, CHuang, XLim, JGuerin, DKarunakaran, GBBakshi, RKLiu, ZFu, JWan, ZLiu, W ERK inhibitors US Patent  US9884048 Publication Date 2/6/2018 
Target
Name:
Mitogen-activated protein kinase 1
Synonyms:
ERK2 Extracellular signal-regulated kinase 2 Extracellular signal-regulated kinase 2 (ERK2) MAPK 2 MK01_HUMAN Mitogen-activated protein kinase 1 (ERK-2) Mitogen-activated protein kinase 2 PRKM2 | p42-MAPK
Type:
Ser/Thr Protein Kinase
Mol. Mass.:
41392.76
Organism:
Homo sapiens (Human)
Description:
P28482
Residue:
360
  
Inhibitor
Name:
BDBM275228
Synonyms:
1-(1-methyl-1-phenylethyl)- 3-[1-(2-methylpyridin-4-yl)- 1H-pyrazolo[3,4-c]pyridin- 5-yl]urea | US9884048, Example 122
Type:
Small organic molecule
Emp. Form.:
C22H22N6O
Mol. Mass.:
386.4497
SMILES:
Cc1cc(ccn1)-n1ncc2cc(NC(=O)NC(C)(C)c3ccccc3)ncc12
: