Target
5-hydroxytryptamine receptor 4
Ligand
BDBM82087
Substrate
Ki
398.1±n/a nM
Comments
PDSP_172
Citation
 Van den Wyngaert, IGommeren, WVerhasselt, PJurzak, MLeysen, JLuyten, WBender, E Cloning and expression of a human serotonin 5-HT4 receptor cDNA. J Neurochem 69:1810-9 (1997)  
Target
Name:
5-hydroxytryptamine receptor 4
Synonyms:
5-HT-4 5-HT4L 5-hydroxytryptamine receptor 4 Htr4 Serotonin 4 (5-HT4) receptor
Type:
Enzyme Catalytic Domain
Mol. Mass.:
46117.31
Organism:
RAT
Description:
5-HT4 HTR4 RAT::Q62758
Residue:
406
  
Inhibitor
Name:
BDBM82087
Synonyms:
2-(5-methoxy-1H-indol-3-yl)ethanamine 5-Methoxytryptamine hydrochloride tryptamine, 5-Methoxy
Type:
Small organic molecule
Emp. Form.:
C11H14N2O
Mol. Mass.:
190.2417
SMILES:
COc1ccc2[nH]cc(CCN)c2c1
: