Target
5-hydroxytryptamine receptor 4
Ligand
BDBM82087
Substrate
Ki
251.18±n/a nM
Comments
PDSP_172
Citation
 Van den Wyngaert, IGommeren, WVerhasselt, PJurzak, MLeysen, JLuyten, WBender, E Cloning and expression of a human serotonin 5-HT4 receptor cDNA. J Neurochem 69:1810-9 (1997)  
Target
Name:
5-hydroxytryptamine receptor 4
Synonyms:
5-HT4 5HT4R_CAVPO Serotonin 4 (5-HT4) receptor
Type:
Enzyme Catalytic Domain
Mol. Mass.:
43735.29
Organism:
GUINEA PIG
Description:
5-HT4 HTR4 GUINEA PIG::O70528
Residue:
388
  
Inhibitor
Name:
BDBM82087
Synonyms:
2-(5-methoxy-1H-indol-3-yl)ethanamine 5-Methoxytryptamine hydrochloride tryptamine, 5-Methoxy
Type:
Small organic molecule
Emp. Form.:
C11H14N2O
Mol. Mass.:
190.2417
SMILES:
COc1ccc2[nH]cc(CCN)c2c1
: