Target
Glutamate receptor 3
Ligand
BDBM82560
Substrate
Ki
1660±n/a nM
Comments
PDSP_704
Citation
 Varney, MARao, SPJachec, CDeal, CHess, SDDaggett, LPLin, FJohnson, ECVeliçelebi, G Pharmacological characterization of the human ionotropic glutamate receptor subtype GluR3 stably expressed in mammalian cells. J Pharmacol Exp Ther 285:358-70 (1998) Target
Name:
Glutamate receptor 3
Synonyms:
AMPA-selective glutamate receptor 3 GLURC GRIA3_HUMAN GluR-C Glutamate receptor 3 Glutamate receptor ionotropic, AMPA 3
Type:
PROTEIN
Mol. Mass.:
101172.14
Organism:
Homo sapiens (Human)
Description:
ChEMBL_468627
Residue:
894
  
Inhibitor
Name:
BDBM82560
Synonyms:
CAS_2379-57-9 NSC_3140
Type:
Small organic molecule
Emp. Form.:
C8H2N4O6
Mol. Mass.:
250.1247
SMILES:
[O-][N+](=O)c1cc2=NC(=O)C(=O)N=c2cc1[N+]([O-])=O
: