Target
Glutamate receptor 3
Ligand
BDBM84949
Substrate
Ki
630±n/a nM
Comments
PDSP_1986
Citation
 Varney, MARao, SPJachec, CDeal, CHess, SDDaggett, LPLin, FJohnson, ECVeliçelebi, G Pharmacological characterization of the human ionotropic glutamate receptor subtype GluR3 stably expressed in mammalian cells. J Pharmacol Exp Ther 285:358-70 (1998) Target
Name:
Glutamate receptor 3
Synonyms:
AMPA-selective glutamate receptor 3 GLURC GRIA3_HUMAN GluR-C Glutamate receptor 3 Glutamate receptor ionotropic, AMPA 3
Type:
PROTEIN
Mol. Mass.:
101172.14
Organism:
Homo sapiens (Human)
Description:
ChEMBL_468627
Residue:
894
  
Inhibitor
Name:
BDBM84949
Synonyms:
CAS_3035216 YM90k
Type:
Small organic molecule
Emp. Form.:
C11H7N5O4
Mol. Mass.:
273.2044
SMILES:
ON(O)c1cc2=NC(=O)C(=O)N=c2cc1-n1ccnc1
: