Target
Somatostatin receptor type 2
Ligand
BDBM85230
Substrate
Ki
4.78±n/a nM
Comments
PDSP_3571
Citation
 Meyerhof, W The elucidation of somatostatin receptor functions: a current view. Rev Physiol Biochem Pharmacol 133:55-108 (1998)  
Target
Name:
Somatostatin receptor type 2
Synonyms:
SOMATOSTATIN SST2 Smstr2 Somatostatin receptor 2 Sst2 | Sstr2
Type:
Enzyme Catalytic Domain
Mol. Mass.:
41234.26
Organism:
MOUSE
Description:
SOMATOSTATIN SST2 SSTR2 MOUSE::P30875
Residue:
369
  
Inhibitor
Name:
BDBM85230
Synonyms:
BIM 23313
Type:
Small organic molecule
Emp. Form.:
C54H69N11O9S2
Mol. Mass.:
1080.324
SMILES:
CC(O)[C@@H](NC(=O)[C@H](CCCCN)NC(=O)[C@@H](Cc1c[nH]c2ccccc12)NC(=O)[C@H](Cc1ccccc1)NC(=O)C(Cc1ccccc1)NC(=O)C(N)CS)C(=O)NC(Cc1ccccc1)C(=O)NC(CS)C(N)=O
: