Target
Somatostatin receptor type 2
Ligand
BDBM50059090
Substrate
Ki
0.57±n/a nM
Comments
PDSP_1734
Citation
 Meyerhof, W The elucidation of somatostatin receptor functions: a current view. Rev Physiol Biochem Pharmacol 133:55-108 (1998)  
Target
Name:
Somatostatin receptor type 2
Synonyms:
SOMATOSTATIN SST2 Smstr2 Somatostatin receptor 2 Sst2 | Sstr2
Type:
Enzyme Catalytic Domain
Mol. Mass.:
41234.26
Organism:
MOUSE
Description:
SOMATOSTATIN SST2 SSTR2 MOUSE::P30875
Residue:
369
  
Inhibitor
Name:
BDBM50059090
Synonyms:
10-(4-Amino-butyl)-19-(2-amino-3-phenyl-propionylamino)-16-benzyl-7-(1-hydroxy-ethyl)-13-(1H-indol-3-ylmethyl)-6,9,12,15,18-pentaoxo-1,2-dithia-5,8,11,14,17-pentaaza-cycloicosane-4-carboxylic acid (2-hydroxy-1-hydroxymethyl-propyl)-amide SMS 201-995 | octreotide
Type:
Small organic molecule
Emp. Form.:
C49H66N10O10S2
Mol. Mass.:
1019.239
SMILES:
CC(O)[C@H](CO)NC(=O)[C@@H]1CSSCC(NC(=O)C(N)Cc2ccccc2)C(=O)N[C@H](Cc2ccccc2)C(=O)N[C@H](Cc2c[nH]c3ccccc23)C(=O)N[C@H](CCCCN)C(=O)N[C@H](C(C)O)C(=O)N1
: