Target
5-hydroxytryptamine receptor 4
Ligand
BDBM50007872
Substrate
Ki
123.4±n/a nM
Comments
PDSP_399
Citation
 Blondel, OGastineau, MDahmoune, YLanglois, MFischmeister, R Cloning, expression, and pharmacology of four human 5-hydroxytryptamine 4 receptor isoforms produced by alternative splicing in the carboxyl terminus. J Neurochem 70:2252-61 (1998)  
Target
Name:
5-hydroxytryptamine receptor 4
Synonyms:
5-HT-4 5-HT4S 5-HT4b 5-HT4d 5-hydroxytryptamine receptor 4 5HT4R_HUMAN Serotonin (5-HT) receptor Serotonin 4 (5-HT4) receptor | Serotonin Receptor 4
Type:
Enzyme
Mol. Mass.:
43767.54
Organism:
Homo sapiens (Human)
Description:
Q13639
Residue:
388
  
Inhibitor
Name:
BDBM50007872
Synonyms:
3-Ethyl-2-oxo-2,3-dihydro-benzoimidazole-1-carboxylic acid (8-methyl-8-aza-bicyclo[3.2.1]oct-3-yl)-amide; hydrochloride CHEMBL544755 | CHEMBL62023
Type:
Small organic molecule
Emp. Form.:
C18H24N4O2
Mol. Mass.:
328.4088
SMILES:
CCn1c2ccccc2n(C(=O)NC2CC3CCC(C2)N3C)c1=O
: