Target
Alpha-1A adrenergic receptor
Ligand
BDBM82424
Substrate
Ki
2511.89±n/a nM
Comments
PDSP_1319
Citation
 Wikberg-Matsson, AWikberg, JEUhlén, S Characterization of alpha1-adrenoceptor subtypes in the pig. Eur J Pharmacol 347:301-9 (1998)  
Target
Name:
Alpha-1A adrenergic receptor
Synonyms:
ADA1A_CAVPO adrenergic Alpha1A
Type:
Enzyme Catalytic Domain
Mol. Mass.:
51603.72
Organism:
PIG
Description:
adrenergic Alpha1A ADRA1A PIG::Q9WU25
Residue:
466
  
Inhibitor
Name:
BDBM82424
Synonyms:
CAS_1236 Niguldipine(+)
Type:
Small organic molecule
Emp. Form.:
C36H39N3O6
Mol. Mass.:
609.7114
SMILES:
COC(=O)C1C(C(C(=O)OCCCN2CCC(CC2)(c2ccccc2)c2ccccc2)=C(C)N=C1C)c1cccc(c1)[N+]([O-])=O
: