Target
Prostaglandin E2 receptor EP3 subtype
Ligand
BDBM85173
Substrate
Ki
3501±n/a nM
Comments
PDSP_841
Citation
 Sharif, NAXu, SXWilliams, GWCrider, JYGriffin, BWDavis, TL Pharmacology of [3H]prostaglandin E1/[3H]prostaglandin E2 and [3H]prostaglandin F2alpha binding to EP3 and FP prostaglandin receptor binding sites in bovine corpus luteum: characterization and correlation with functional data. J Pharmacol Exp Ther 286:1094-102 (1998) Target
Name:
Prostaglandin E2 receptor EP3 subtype
Synonyms:
PE2R3_BOVIN Prostaglandin E3
Type:
Enzyme Catalytic Domain
Mol. Mass.:
46379.75
Organism:
BOVINE
Description:
Prostaglandin E3 PTGER3 BOVINE::P34979
Residue:
417
  
Inhibitor
Name:
BDBM85173
Synonyms:
CAS_40666-16-8 NSC_5311100
Type:
Small organic molecule
Emp. Form.:
C23H29F3O6
Mol. Mass.:
458.468
SMILES:
OC(COc1cccc(c1)C(F)(F)F)C=CC1C(O)CC(O)C1CC=CCCCC(O)=O
: