Target
Epidermal growth factor receptor
Ligand
BDBM3260
Substrate
EGF-R Substrate
Meas. Tech.
Kinase Inhibition Assay
pH
7.4±n/a
Temperature
295.15±n/a K
IC50
100000±n/a nM
Citation
 Rewcastle, GWDenny, WABridges, AJZhou, HCody, DRMcMichael, AFry, DW Tyrosine kinase inhibitors. 5. Synthesis and structure-activity relationships for 4-[(phenylmethyl)amino]- and 4-(phenylamino)quinazolines as potent adenosine 5'-triphosphate binding site inhibitors of the tyrosine kinase domain of the epidermal growth factor receptor. J Med Chem 38:3482-7 (1995)  
Target
Name:
Epidermal growth factor receptor
Synonyms:
EGF Receptor Substrate EGFR_HUMAN ERBB1 Epidermal Growth Factor Receptor erbB-1 Epidermal growth factor receptor (EGFR) HER1 Proto-oncogene c-ErbB-1 Tyrosine-Protein Kinase ErbB-1
Type:
Receptor Kinase Domain
Mol. Mass.:
134279.59
Organism:
Homo sapiens (Human)
Description:
P00533
Residue:
1210
  
Inhibitor
Name:
BDBM3260
Synonyms:
4-Anilino quinazoline deriv. 11 | N-methyl-N-phenylquinazolin-4-amine
Type:
Small organic molecule
Emp. Form.:
C15H13N3
Mol. Mass.:
235.2838
SMILES:
CN(c1ccccc1)c1ncnc2ccccc12
:
Substrate
Name:
EGF-R Substrate
Synonyms:
Type:
Peptide
Mol. Mass.:
4119.23
Organism:
Description:
The sequence is based on a portion of phospholipase C-gamma. 10 uM ATP containing 1 uCi of [gamma-32P]ATP as co-substrate.
Residue:
38