Target
Somatostatin receptor type 2
Ligand
BDBM85357
Substrate
Ki
0.01±n/a nM
Comments
PDSP_7578
Citation
 Yang, LBerk, SCRohrer, SPMosley, RTGuo, LUnderwood, DJArison, BHBirzin, ETHayes, ECMitra, SWParmar, RMCheng, KWu, TJButler, BSFoor, FPasternak, APan, YSilva, MFreidinger, RMSmith, RGChapman, KSchaeffer, JMPatchett, AA Synthesis and biological activities of potent peptidomimetics selective for somatostatin receptor subtype 2. Proc Natl Acad Sci U S A 95:10836-41 (1998)  
Target
Name:
Somatostatin receptor type 2
Synonyms:
SOMATOSTATIN SST2 SS-2-R SS2R SSTR2 | Somatostatin receptor type 2 (SSTR2)
Type:
Enzyme
Mol. Mass.:
41344.94
Organism:
Homo sapiens (Human)
Description:
P30874
Residue:
369
  
Inhibitor
Name:
BDBM85357
Synonyms:
2-[[(2R,3S)-2-[[4-[(2-Oxo-2,3-dihydro-1H-benzimidazole)-1-yl]piperidino]carbonylamino]-3-(1H-indole-3-yl)butyryl]amino]-6-aminohexanoic acid tert-butyl ester L-054522
Type:
Small organic molecule
Emp. Form.:
C35H47N7O5
Mol. Mass.:
645.7916
SMILES:
C[C@H]([C@@H](NC(=O)N1CCC(CC1)n1c2ccccc2[nH]c1=O)C(=O)NC(CCCCN)C(=O)OC(C)(C)C)c1c[nH]c2ccccc12
: