Target
Metabotropic glutamate receptor 2
Ligand
BDBM85077
Substrate
Ki
263±n/a nM
Comments
PDSP_2027
Citation
 Mutel, VAdam, GChaboz, SKemp, JAKlingelschmidt, AMesser, JWichmann, JWoltering, TRichards, JG Characterization of (2S,2'R,3'R)-2-(2',3'-[3H]-dicarboxycyclopropyl)glycine binding in rat brain. J Neurochem 71:2558-64 (1998)  
Target
Name:
Metabotropic glutamate receptor 2
Synonyms:
GPRC1B GRM2_HUMAN Metabotropic glutamate receptor mGlu2 | metabotropic glutamate 2
Type:
Enzyme
Mol. Mass.:
95584.88
Organism:
Homo sapiens (Human)
Description:
Q14416
Residue:
872
  
Inhibitor
Name:
BDBM85077
Synonyms:
3-Phosphono-D,L-2-aminopropionic acid, 7 L-AP3 | NSC_3857
Type:
Small organic molecule
Emp. Form.:
C3H8NO5P
Mol. Mass.:
169.0731
SMILES:
NC(CP(O)(O)=O)C(O)=O
: