Target
Metabotropic glutamate receptor 2
Ligand
BDBM50089910
Substrate
Ki
260±n/a nM
Comments
PDSP_2023
Citation
 Mutel, VAdam, GChaboz, SKemp, JAKlingelschmidt, AMesser, JWichmann, JWoltering, TRichards, JG Characterization of (2S,2'R,3'R)-2-(2',3'-[3H]-dicarboxycyclopropyl)glycine binding in rat brain. J Neurochem 71:2558-64 (1998)  
Target
Name:
Metabotropic glutamate receptor 2
Synonyms:
GPRC1B GRM2_HUMAN Metabotropic glutamate receptor mGlu2 | metabotropic glutamate 2
Type:
Enzyme
Mol. Mass.:
95584.88
Organism:
Homo sapiens (Human)
Description:
Q14416
Residue:
872
  
Inhibitor
Name:
BDBM50089910
Synonyms:
2-Amino-2-(4-phosphono-phenyl)-propionic acid CHEMBL86508 | MPPG
Type:
Small organic molecule
Emp. Form.:
C9H12NO5P
Mol. Mass.:
245.169
SMILES:
CC(N)(C(O)=O)c1ccc(cc1)P(O)(O)=O
: