Target
Vasopressin V1a receptor
Ligand
BDBM35723
Substrate
Ki
325±n/a nM
Comments
PDSP_1417
Citation
 Yamamura, YNakamura, SItoh, SHirano, TOnogawa, TYamashita, TYamada, YTsujimae, KAoyama, MKotosai, KOgawa, HYamashita, HKondo, KTominaga, MTsujimoto, GMori, T OPC-41061, a highly potent human vasopressin V2-receptor antagonist: pharmacological profile and aquaretic effect by single and multiple oral dosing in rats. J Pharmacol Exp Ther 287:860-7 (1998) Target
Name:
Vasopressin V1a receptor
Synonyms:
Avpr1a VASOPRESSIN V1A Vasopressin V1a receptor | Vasopressin receptor
Type:
Enzyme Catalytic Domain
Mol. Mass.:
47674.81
Organism:
RAT
Description:
VASOPRESSIN V1A AVPR1A RAT::P30560
Residue:
424
  
Inhibitor
Name:
BDBM35723
Synonyms:
CHEMBL344159 TOLVAPTAN | benzazepine derivative, 32
Type:
Small organic molecule
Emp. Form.:
C26H25ClN2O3
Mol. Mass.:
448.941
SMILES:
Cc1ccccc1C(=O)Nc1ccc(C(=O)N2CCCC(O)c3cc(Cl)ccc23)c(C)c1
: