Target
Neuromedin-B receptor
Ligand
BDBM85500
Substrate
Ki
6±n/a nM
Comments
PDSP_411
Citation
 Katsuno, TPradhan, TKRyan, RRMantey, SAHou, WDonohue, PJAkeson, MASpindel, ERBattey, JFCoy, DHJensen, RT Pharmacology and cell biology of the bombesin receptor subtype 4 (BB4-R). Biochemistry 38:7307-20 (1999)  
Target
Name:
Neuromedin-B receptor
Synonyms:
NMB Neuromedin B receptor Nmbr
Type:
Enzyme Catalytic Domain
Mol. Mass.:
43540.92
Organism:
RAT
Description:
NMB 0 RAT::P24053
Residue:
390
  
Inhibitor
Name:
BDBM85500
Synonyms:
Bombesin,Phe13
Type:
Small organic molecule
Emp. Form.:
C74H108N24O18S
Mol. Mass.:
1653.864
SMILES:
CSCC[C@H](NC(=O)[C@H](Cc1ccccc1)NC(=O)[C@H](Cc1cnc[nH]1)NC(=O)CNC(=O)[C@@H](NC(=O)[C@H](C)NC(=O)[C@H](Cc1c[nH]c2ccccc12)NC(=O)[C@H](CCC(N)=O)NC(=O)[C@H](CC(N)=O)NC(=O)CNC(=O)[C@H](CC(C)C)NC(=O)[C@H](CCCN=C(N)N)NC(=O)[C@H](CCC(N)=O)NC(=O)[C@@H]1CCC(=O)N1)C(C)C)C(N)=O
: