Target
Prostaglandin G/H synthase 1
Ligand
BDBM50009860
Substrate
Ki
9300±n/a nM
Comments
PDSP_3996
Citation
 Warner, TDGiuliano, FVojnovic, IBukasa, AMitchell, JAVane, JR Nonsteroid drug selectivities for cyclo-oxygenase-1 rather than cyclo-oxygenase-2 are associated with human gastrointestinal toxicity: a full in vitro analysis. Proc Natl Acad Sci U S A 96:7563-8 (1999)  
Target
Name:
Prostaglandin G/H synthase 1
Synonyms:
COX-1 Cyclooxygenase Cyclooxygenase-1 (COX-1) PTGS1 | Prostaglandin G/H synthase (cyclooxygenase)
Type:
Enzyme
Mol. Mass.:
68692.62
Organism:
Homo sapiens (Human)
Description:
P23219
Residue:
599
  
Inhibitor
Name:
BDBM50009860
Synonyms:
2-(6-Methoxy-naphthalen-2-yl)-propionic acid 2-(6-methoxy-2-naphthyl)propanoic acid CHEMBL154 Naproxen2-(6-Methoxy-naphthalen-2-yl)-propionic acid
Type:
Small organic molecule
Emp. Form.:
C14H14O3
Mol. Mass.:
230.2592
SMILES:
COc1ccc2cc(ccc2c1)C(C)C(O)=O
: