Target
Prostaglandin E2 receptor EP3 subtype
Ligand
BDBM85338
Substrate
Ki
12±n/a nM
Comments
PDSP_782
Citation
 Abramovitz, MAdam, MBoie, YCarrière, MDenis, DGodbout, CLamontagne, SRochette, CSawyer, NTremblay, NMBelley, MGallant, MDufresne, CGareau, YRuel, RJuteau, HLabelle, MOuimet, NMetters, KM The utilization of recombinant prostanoid receptors to determine the affinities and selectivities of prostaglandins and related analogs. Biochim Biophys Acta 1483:285-93 (2000)  
Target
Name:
Prostaglandin E2 receptor EP3 subtype
Synonyms:
PE2R3_HUMAN PGE2-R Prostaglandin E2 receptor Prostaglandin E2 receptor EP3 subtype (EP3) Prostaglandin E2 receptor EP3D subtype (EP3D) | Prostanoid EP3 receptor
Type:
Enzyme
Mol. Mass.:
43335.03
Organism:
Homo sapiens (Human)
Description:
P43115
Residue:
390
  
Inhibitor
Name:
BDBM85338
Synonyms:
CAS_73121-56-9 NSC_5282207
Type:
Small organic molecule
Emp. Form.:
C23H28O6
Mol. Mass.:
400.4648
SMILES:
COC(=O)CCC=C=CCC1C(C=CC(O)COc2ccccc2)C(O)CC1=O
: