Target
Prostaglandin E2 receptor EP4 subtype
Ligand
BDBM85177
Substrate
Ki
10±n/a nM
Comments
PDSP_1159
Citation
 Abramovitz, MAdam, MBoie, YCarrière, MDenis, DGodbout, CLamontagne, SRochette, CSawyer, NTremblay, NMBelley, MGallant, MDufresne, CGareau, YRuel, RJuteau, HLabelle, MOuimet, NMetters, KM The utilization of recombinant prostanoid receptors to determine the affinities and selectivities of prostaglandins and related analogs. Biochim Biophys Acta 1483:285-93 (2000)  
Target
Name:
Prostaglandin E2 receptor EP4 subtype
Synonyms:
PE2R4_HUMAN PGE2 receptor EP4 subtype PTGER4 Prostanoid EP4 receptor
Type:
Enzyme
Mol. Mass.:
53134.53
Organism:
Homo sapiens (Human)
Description:
P35408
Residue:
488
  
Inhibitor
Name:
BDBM85177
Synonyms:
CAS_80558-61-8 NSC_119139
Type:
Small organic molecule
Emp. Form.:
C22H30O5
Mol. Mass.:
374.4706
SMILES:
OC(COc1ccccc1)C=CC1CCC(=O)C1CCCCCCC(O)=O
: