Target
Prostaglandin F2-alpha receptor
Ligand
BDBM82213
Substrate
Ki
6.7±n/a nM
Comments
PDSP_1458
Citation
 Abramovitz, MAdam, MBoie, YCarrière, MDenis, DGodbout, CLamontagne, SRochette, CSawyer, NTremblay, NMBelley, MGallant, MDufresne, CGareau, YRuel, RJuteau, HLabelle, MOuimet, NMetters, KM The utilization of recombinant prostanoid receptors to determine the affinities and selectivities of prostaglandins and related analogs. Biochim Biophys Acta 1483:285-93 (2000)  
Target
Name:
Prostaglandin F2-alpha receptor
Synonyms:
PF2R_HUMAN PGF2 alpha receptor PTGFR Prostanoid FP receptor
Type:
Enzyme
Mol. Mass.:
40072.29
Organism:
Homo sapiens (Human)
Description:
P43088
Residue:
359
  
Inhibitor
Name:
BDBM82213
Synonyms:
CAS_41598-07-6 PGD2
Type:
Small organic molecule
Emp. Form.:
C20H30O4
Mol. Mass.:
334.4498
SMILES:
CCCCCC(O)CC=C1C(CC=CCCCC(O)=O)C=CC1=O
: