Target
Prostacyclin receptor
Ligand
BDBM85173
Substrate
Ki
>10000±n/a nM
Comments
PDSP_841
Citation
 Abramovitz, MAdam, MBoie, YCarrière, MDenis, DGodbout, CLamontagne, SRochette, CSawyer, NTremblay, NMBelley, MGallant, MDufresne, CGareau, YRuel, RJuteau, HLabelle, MOuimet, NMetters, KM The utilization of recombinant prostanoid receptors to determine the affinities and selectivities of prostaglandins and related analogs. Biochim Biophys Acta 1483:285-93 (2000)  
Target
Name:
Prostacyclin receptor
Synonyms:
PGI receptor PRIPR Prostacyclin (IP) Receptor Prostaglandin I Prostaglandin I2 receptor | Prostanoid IP receptor
Type:
G Protein-Coupled Receptor (GPCR)
Mol. Mass.:
40968.22
Organism:
Homo sapiens (Human)
Description:
The membranes prepared from human platelet were used in binding assay.
Residue:
386
  
Inhibitor
Name:
BDBM85173
Synonyms:
CAS_40666-16-8 NSC_5311100
Type:
Small organic molecule
Emp. Form.:
C23H29F3O6
Mol. Mass.:
458.468
SMILES:
OC(COc1cccc(c1)C(F)(F)F)C=CC1C(O)CC(O)C1CC=CCCCC(O)=O
: