Target
Lysine-specific demethylase 2B
Ligand
BDBM276085
Substrate
Meas. Tech.
FBXL10 Assay
Temperature
298.15±n/a K
IC50
<100±n/a nM
Comments
extracted
Citation
 Chen, YKNie, ZStafford, JAVeal, JM Histone demethylase inhibitors US Patent  US10071984 Publication Date 9/11/2018 
Target
Name:
Lysine-specific demethylase 2B
Synonyms:
AA 1-650 FBL10 Homo sapiens lysine demethylase 2B (KDM2B) KDM2B Lysine-specific demethylase 2B NDY1 PCCX2
Type:
Enzyme Catalytic Domain
Mol. Mass.:
152658.35
Organism:
Homo sapiens (Human)
Description:
Q8NHM5
Residue:
1336
  
Inhibitor
Name:
BDBM276085
Synonyms:
1-[(4-chlorophenyl)methyl]-4-{1H-[1,2,3]triazolo[4,5-c]pyridin-6-yl}-1H-imidazole US10174003, Example 47 | US9896436, Example 47
Type:
Small organic molecule
Emp. Form.:
C15H11ClN6
Mol. Mass.:
310.741
SMILES:
Clc1ccc(Cn2cnc(c2)-c2cc3[nH]nnc3cn2)cc1
: