Target
Carbonic anhydrase 5A, mitochondrial
Ligand
BDBM10880
Substrate
Meas. Tech.
CA Assay
pH
7.4±0
Temperature
293.15±0 K
Ki
60±0.0 nM
Citation
 Supuran, CTScozzafava, A Benzolamide is not a membrane-impermeant carbonic anhydrase inhibitor. J Enzyme Inhib Med Chem 19:269-73 (2004)  
Target
Name:
Carbonic anhydrase 5A, mitochondrial
Synonyms:
CAH5A_MOUSE Ca5a Car5a Carbonic Anhydrase V Carbonic anhydrase 5A, mitochondrial precursor
Type:
Enzyme
Mol. Mass.:
34081.17
Organism:
Mus musculus (mouse)
Description:
Full length murine, cloned isozyme.
Residue:
299
  
Inhibitor
Name:
BDBM10880
Synonyms:
AZA AZM acetazolamide Acetazolamide Acetazolamide (AZA) Acetazolamide, 5 Acetazolamide, AZA CHEMBL20 Sulfonamide, 1 US11278534, Example acetazolamide sulfonamide 1
Type:
Small organic molecule
Emp. Form.:
C4H6N4O3S2
Mol. Mass.:
222.245
SMILES:
CC(=O)Nc1nnc(s1)S(N)(=O)=O
: