Target
5-hydroxytryptamine receptor 6
Ligand
BDBM50167898
Substrate
Ki
>10000±n/a nM
Comments
PDSP_1676
Citation
 Reavill, CTaylor, SGWood, MDAshmeade, TAustin, NEAvenell, KYBoyfield, IBranch, CLCilia, JColdwell, MCHadley, MSHunter, AJJeffrey, PJewitt, FJohnson, CNJones, DNMedhurst, ADMiddlemiss, DNNash, DJRiley, GJRoutledge, CStemp, GThewlis, KMTrail, BVong, AKHagan, JJ Pharmacological actions of a novel, high-affinity, and selective human dopamine D(3) receptor antagonist, SB-277011-A. J Pharmacol Exp Ther 294:1154-65 (2000) Target
Name:
5-hydroxytryptamine receptor 6
Synonyms:
5-HT-6 5-hydroxytryptamine receptor 6 (5-HT-6) 5-hydroxytryptamine receptor 6 (5HT6) HTR6 Serotonin 6 (5-HT6) receptor | Serotonin Receptor 6
Type:
G Protein-Coupled Receptor (GPCR)
Mol. Mass.:
46968.43
Organism:
Homo sapiens (Human)
Description:
P50406
Residue:
440
  
Inhibitor
Name:
BDBM50167898
Synonyms:
CHEMBL85606 N-(-4-(2-(6-cyano-3,4-dihydroisoquinolin-2(1H)-yl)ethyl)cyclohexyl)quinoline-4-carboxamide SB-277011 trans-N-[4-[2-(6-cyano-1,2,3,4-tetrahydroisoquinolin-2yl)-ethyl]cyclo-hexyl]-4-quinolinecarboxamide | trans-N-[4-[2-(6-cyano-1,2,3,4-tetrahydroisoquinolin-2yl)ethyl]-cyclohexyl]-4-quinolininecarboxamide
Type:
Small organic molecule
Emp. Form.:
C28H30N4O
Mol. Mass.:
438.564
SMILES:
O=C(NC1CC[C@H](CCN2CCc3cc(ccc3C2)C#N)CC1)c1ccnc2ccccc12
: