Target
Delta-type opioid receptor
Ligand
BDBM85749
Substrate
Ki
60.3±n/a nM
Comments
PDSP_2075
Citation
 Hashiba, EHarrison, CGalo', GGuerrini, RRowbotham, DJSmith, GLambert, DG Characterisation and comparison of novel ligands for the nociceptin/orphanin FQ receptor. Naunyn Schmiedebergs Arch Pharmacol 363:28-33 (2001)  
Target
Name:
Delta-type opioid receptor
Synonyms:
D-OR-1 Delta opioid receptor OPIATE Delta OPRD1 OPRK1 | opioid receptor, delta 1
Type:
G Protein-Coupled Receptor (GPCR)
Mol. Mass.:
40382.98
Organism:
Homo sapiens (Human)
Description:
Competition binding assays were carried out using membrane preparations from transfected HN9.10 cells that constitutively expressed the delta opioid receptor.
Residue:
372
  
Inhibitor
Name:
BDBM85749
Synonyms:
III-BTD | NOCICEPTIN RECEPTOR ANTAGONIST PEPTIDE III-BTD
Type:
Small organic molecule
Emp. Form.:
C40H62ClN13O7S
Mol. Mass.:
904.521
SMILES:
[#6]-[#6](=O)-[#7]-[#6@@H](-[#6]-[#6]-[#6]\[#7]=[#6](\[#7])-[#7])-[#6](=O)-[#7]-[#6@H](-[#6]-[#6]-1-[#6]-[#6]-[#6]-[#6]-[#6]-1)-[#6](=O)-[#7]-[#6@H]-1-[#6]-[#6]-[#6@@H]-2-[#16]-[#6]-[#6@H](-[#7]-2-[#6]-1=O)-[#6](=O)-[#7]-[#6@H](-[#6]-[#6]-[#6]\[#7]=[#6](\[#7])-[#7])-[#6](=O)-[#7]-[#6@H](-[#6]-c1ccc(Cl)cc1)-[#6](-[#7])=O
: