Target
Kappa-type opioid receptor
Ligand
BDBM85749
Substrate
Ki
11.5±n/a nM
Comments
PDSP_2075
Citation
 Hashiba, EHarrison, CGalo', GGuerrini, RRowbotham, DJSmith, GLambert, DG Characterisation and comparison of novel ligands for the nociceptin/orphanin FQ receptor. Naunyn Schmiedebergs Arch Pharmacol 363:28-33 (2001)  
Target
Name:
Kappa-type opioid receptor
Synonyms:
K-OR-1 Kappa-opioid receptor (KOR) Kappa-type opioid receptor (KOR) OPIATE Kappa OPRK1 kappa opioid receptor (KOR)
Type:
G Protein-Coupled Receptor (GPCR)
Mol. Mass.:
42648.76
Organism:
Homo sapiens (Human)
Description:
P41145
Residue:
380
  
Inhibitor
Name:
BDBM85749
Synonyms:
III-BTD | NOCICEPTIN RECEPTOR ANTAGONIST PEPTIDE III-BTD
Type:
Small organic molecule
Emp. Form.:
C40H62ClN13O7S
Mol. Mass.:
904.521
SMILES:
[#6]-[#6](=O)-[#7]-[#6@@H](-[#6]-[#6]-[#6]\[#7]=[#6](\[#7])-[#7])-[#6](=O)-[#7]-[#6@H](-[#6]-[#6]-1-[#6]-[#6]-[#6]-[#6]-[#6]-1)-[#6](=O)-[#7]-[#6@H]-1-[#6]-[#6]-[#6@@H]-2-[#16]-[#6]-[#6@H](-[#7]-2-[#6]-1=O)-[#6](=O)-[#7]-[#6@H](-[#6]-[#6]-[#6]\[#7]=[#6](\[#7])-[#7])-[#6](=O)-[#7]-[#6@H](-[#6]-c1ccc(Cl)cc1)-[#6](-[#7])=O
: