Target
5-hydroxytryptamine receptor 4
Ligand
BDBM85778
Substrate
Ki
1.3±n/a nM
Comments
PDSP_2063
Citation
 Bach, TSyversveen, TKvingedal, AMKrobert, KABrattelid, TKaumann, AJLevy, FO 5HT4(a) and 5-HT4(b) receptors have nearly identical pharmacology and are both expressed in human atrium and ventricle. Naunyn Schmiedebergs Arch Pharmacol 363:146-60 (2001)  
Target
Name:
5-hydroxytryptamine receptor 4
Synonyms:
5-HT-4 5-HT4S 5-HT4b 5-HT4d 5-hydroxytryptamine receptor 4 5HT4R_HUMAN Serotonin (5-HT) receptor Serotonin 4 (5-HT4) receptor | Serotonin Receptor 4
Type:
Enzyme
Mol. Mass.:
43767.54
Organism:
Homo sapiens (Human)
Description:
Q13639
Residue:
388
  
Inhibitor
Name:
BDBM85778
Synonyms:
CAS_135938-17-9 | SB203186
Type:
Small organic molecule
Emp. Form.:
C16H20N2O2
Mol. Mass.:
272.3422
SMILES:
O=C(OCCN1CCCCC1)c1c[nH]c2ccccc12
: