Target
Gamma-aminobutyric acid receptor subunit alpha-2
Ligand
BDBM85806
Substrate
Ki
12.3±n/a nM
Comments
PDSP_2445
Citation
 Griebel, GPerrault, GSimiand, JCohen, CGranger, PDecobert, MFrançon, DAvenet, PDepoortere, HTan, SOblin, ASchoemaker, HEvanno, YSevrin, MGeorge, PScatton, B SL651498: an anxioselective compound with functional selectivity for alpha2- and alpha3-containing gamma-aminobutyric acid(A) (GABA(A)) receptors. J Pharmacol Exp Ther 298:753-68 (2001) Target
Name:
Gamma-aminobutyric acid receptor subunit alpha-2
Synonyms:
GABA A Alpha2Beta2Gamma2 GABA A receptor alpha-2/beta-2/gamma-2 GABA(A) receptor subunit alpha-2 Gabra-2 Gamma-aminobutyric acid receptor subunit alpha-2
Type:
Enzyme
Mol. Mass.:
51195.57
Organism:
Rattus norvegicus (Rat)
Description:
P23576
Residue:
451
  
Inhibitor
Name:
BDBM85806
Synonyms:
6-FLUOR-2-FENYL-9-METHYL-4-(PYRROLIDINE-1-CARBONYL)-9H-PYRIDO[3,4B]INDOOL-1(2H)-ON SL651498
Type:
Small organic molecule
Emp. Form.:
C23H20FN3O2
Mol. Mass.:
389.4222
SMILES:
Cn1c2ccc(F)cc2c2c(cn(-c3ccccc3)c(=O)c12)C(=O)N1CCCC1
: