Target
Bone morphogenetic protein receptor type-1B
Ligand
BDBM148329
Substrate
Meas. Tech.
Enzyme Assay
IC50
2970±n/a nM
Citation
 Alimardanov, ACuny, GDGrewal, GSLee, AMcKew, JCMohedas, AHShen, MXu, XYu, PB BMP inhibitors and methods of use thereof US Patent  US10017516 Publication Date 7/10/2018 
Target
Name:
Bone morphogenetic protein receptor type-1B
Synonyms:
ALK-6 BMPR1B Bone morphogenetic protein receptor type-1B (BMPR1B)
Type:
Enzyme
Mol. Mass.:
56939.41
Organism:
Homo sapiens (Human)
Description:
O00238
Residue:
502
  
Inhibitor
Name:
BDBM148329
Synonyms:
US10017516, Compound 19 | US9682983, 19
Type:
Small organic molecule
Emp. Form.:
C28H29N7
Mol. Mass.:
463.5768
SMILES:
CN(C)Cc1ccc2c(ccnc2c1)-c1cnn2cc(cnc12)-c1ccc(cc1)N1CCNCC1
: