Target
Glutamate receptor 3
Ligand
BDBM50316376
Substrate
Ki
25±n/a nM
Comments
PDSP_3681
Citation
 Johansen, TNStensbøl, TBNielsen, BVogensen, SBFrydenvang, KSløk, FABräüner-Osborne, HMadsen, UKrogsgaard-Larsen, P Resolution, configurational assignment, and enantiopharmacology at glutamate receptors of 2-amino-3-(3-carboxy-5-methyl-4-isoxazolyl)propionic acid (ACPA) and demethyl-ACPA. Chirality 13:523-32 (2001)  
Target
Name:
Glutamate receptor 3
Synonyms:
GRIA3_RAT Glutamate receptor 3 Glutamate-AMPA | Gria3
Type:
Enzyme Catalytic Domain
Mol. Mass.:
100383.57
Organism:
RAT
Description:
Glutamate-AMPA GRIA3 RAT::P19492
Residue:
888
  
Inhibitor
Name:
BDBM50316376
Synonyms:
(S)-2-amino-3-(3-carboxy-5-methyl-4-isoxazolyl)propionic acid CHEMBL602962 | S)-4-(2-amino-2-carboxyethyl)-5-methylisoxazole-3-carboxylic acid
Type:
Small organic molecule
Emp. Form.:
C8H10N2O5
Mol. Mass.:
214.1754
SMILES:
Cc1onc(C(O)=O)c1C[C@H](N)C(O)=O
: