Target
Histamine H3 receptor
Ligand
BDBM85829
Substrate
Ki
10.72±n/a nM
Comments
PDSP_2294
Citation
 Wieland, KBongers, GYamamoto, YHashimoto, TYamatodani, AMenge, WMTimmerman, HLovenberg, TWLeurs, R Constitutive activity of histamine h(3) receptors stably expressed in SK-N-MC cells: display of agonism and inverse agonism by H(3) antagonists. J Pharmacol Exp Ther 299:908-14 (2001) Target
Name:
Histamine H3 receptor
Synonyms:
G-protein coupled receptor 97 HH3R HRH3 Histamine H3 receptor (H3) Histamine receptor (H3 and H4)
Type:
G Protein-Coupled Receptor (GPCR)
Mol. Mass.:
48691.47
Organism:
Homo sapiens (Human)
Description:
Binding assays were using CHO cells stably expressing hH3R receptors.
Residue:
445
  
Inhibitor
Name:
BDBM85829
Synonyms:
VUF4903
Type:
Small organic molecule
Emp. Form.:
C14H25N3
Mol. Mass.:
235.3684
SMILES:
C(CCNC1CCCCC1)CCc1cnc[nH]1
: