Target
Phosphatidylinositol 3,4,5-trisphosphate 5-phosphatase 2
Ligand
BDBM82071
Substrate
Ki
1000±n/a nM
Comments
PDSP_1947
Citation
 Bymaster, FPDreshfield-Ahmad, LJThrelkeld, PGShaw, JLThompson, LNelson, DLHemrick-Luecke, SKWong, DT Comparative affinity of duloxetine and venlafaxine for serotonin and norepinephrine transporters in vitro and in vivo, human serotonin receptor subtypes, and other neuronal receptors. Neuropsychopharmacology 25:871-80 (2001)  
Target
Name:
Phosphatidylinositol 3,4,5-trisphosphate 5-phosphatase 2
Synonyms:
Inositol Triphosphate Phosphatidylinositol-3,4,5-trisphosphate 5-phosphatase 2 Ship2
Type:
Enzyme Catalytic Domain
Mol. Mass.:
139139.35
Organism:
RAT
Description:
Inositol Triphosphate 0 RAT::Q9WVR3
Residue:
1257
  
Inhibitor
Name:
BDBM82071
Synonyms:
CAS_93413-69-5 NSC_62923 Venlafaxine hydrochloride WY-45655
Type:
Small organic molecule
Emp. Form.:
C17H27NO2
Mol. Mass.:
277.4018
SMILES:
COc1ccc(cc1)C(CN(C)C)C1(O)CCCCC1
: