Target
Alpha-1D adrenergic receptor
Ligand
BDBM85848
Substrate
Ki
0.91±n/a nM
Comments
PDSP_2089
Citation
 Hancock, AABuckner, SABrune, MEEsbenshade, TAIreland, LMKatwala, SMilicic, IMeyer, MDKerwin, JFWilliams, M Preclinical pharmacology of fiduxosin, a novel alpha(1)-adrenoceptor antagonist with uroselective properties. J Pharmacol Exp Ther 300:478-86 (2002)  
Target
Name:
Alpha-1D adrenergic receptor
Synonyms:
ADA1D_HUMAN ADRA1D Adrenergic receptor alpha Alpha 1D-adrenoreceptor Alpha-1D adrenoceptor adrenergic Alpha1D
Type:
Enzyme Catalytic Domain
Mol. Mass.:
60485.82
Organism:
Homo sapiens (Human)
Description:
adrenergic Alpha1D ADRA1D HUMAN::P25100
Residue:
572
  
Inhibitor
Name:
BDBM85848
Synonyms:
CAS_172307 NSC_172307
Type:
Small organic molecule
Emp. Form.:
C30H29N5O4S
Mol. Mass.:
555.647
SMILES:
COc1cccc2OCC3CN(CCCCn4c(=O)[nH]c5c6nc(cnc6sc5c4=O)-c4ccccc4)CC3c12
: