Target
Orexin/Hypocretin receptor type 1
Ligand
BDBM164137
Substrate
Meas. Tech.
Radioligand Binding Assay
Temperature
277.15±n/a K
Ki
33±n/a nM
Comments
extracted
Citation
 Coate, HRDvorak, CALebold, TPPreville, CShireman, BT Substituted 7-azabicycles and their use as orexin receptor modulators US Patent  US9695183 Publication Date 7/4/2017 
Target
Name:
Orexin/Hypocretin receptor type 1
Synonyms:
Hcrtr1 OX1R_RAT Orexin receptor type 1 (OX1R) Ox1-R | Ox1R
Type:
Protein
Mol. Mass.:
46817.55
Organism:
Rattus norvegicus (Rat)
Description:
P56718
Residue:
416
  
Inhibitor
Name:
BDBM164137
Synonyms:
US9062078, 267 US9637496, 267 | US9695183, 267
Type:
Small organic molecule
Emp. Form.:
C22H18F4N6O
Mol. Mass.:
458.4115
SMILES:
Fc1ccc(C(=O)N2C3CCC2C(C3)Nc2cnc(cn2)C(F)(F)F)c(c1)-c1ncccn1
: