Target
Transthyretin
Ligand
BDBM249506
Substrate
Meas. Tech.
Scintillation Proximity RBP4 Binding Assay
pH
7.4±n/a
Temperature
298.15±n/a K
IC50
21.8±n/a nM
Comments
extracted
Citation
 Petrukhin, KCioffi, CJohnson, GAllikmets, RFreeman, EChen, PConlon, MZhu, L Substituted 4-phenylpiperidines, their preparation and use US Patent  US10072016 Publication Date 9/11/2018 
Target
Name:
Transthyretin
Synonyms:
ATTR Prealbumin TTHY_HUMAN Transthyretin (TTR)
Type:
Enzyme
Mol. Mass.:
15884.31
Organism:
Homo sapiens (Human)
Description:
P02766
Residue:
147
  
Inhibitor
Name:
BDBM249506
Synonyms:
US10072016, Compound 104 US10913746, Compound 104 US9434727, 104 | US9777010, Compound 104
Type:
Small organic molecule
Emp. Form.:
C24H20F5N5O2
Mol. Mass.:
505.4399
SMILES:
Fc1ccc(C2CCN(CC2)C(=O)c2n[nH]c3CN(Cc23)C(=O)c2cccnc2)c(c1F)C(F)(F)F
: