Target
D(2) dopamine receptor
Ligand
BDBM50001888
Substrate
Ki
4±n/a nM
Comments
PDSP_513
Citation
 Kroeze, WKHufeisen, SJPopadak, BARenock, SMSteinberg, SErnsberger, PJayathilake, KMeltzer, HYRoth, BL H1-histamine receptor affinity predicts short-term weight gain for typical and atypical antipsychotic drugs. Neuropsychopharmacology 28:519-26 (2003)  
Target
Name:
D(2) dopamine receptor
Synonyms:
D(2) dopamine receptor DOPAMINE D2 Long DRD2 Dopamine D2 receptor Dopamine D2 receptor (D2R) Dopamine2-like | d2
Type:
Cell-surface receptors
Mol. Mass.:
50647.10
Organism:
Homo sapiens (Human)
Description:
P14416
Residue:
443
  
Inhibitor
Name:
BDBM50001888
Synonyms:
(chloropromazine) [3-(2-Chloro-phenothiazin-10-yl)-propyl]-dimethyl-amine 1-(2-Allyl-phenoxy)-3-isopropylamino-propan-2-ol 3-(2-chloro-10H-phenothiazin-10-yl)-N,N-dimethylpropan-1-amine CHLORPROMAZINE CHLORPROMAZINE HYDROCHLORIDE CHLORPROMAZINE TANNATE PROMAPAR THORAZINE [3-(2-Chloro-phenothiazin-10-yl)-propyl]-dimethyl-amine( Chlorpromazine) chloropromazine | med.21724, Compound 15
Type:
Small organic molecule
Emp. Form.:
C17H19ClN2S
Mol. Mass.:
318.864
SMILES:
CN(C)CCCN1c2ccccc2Sc2ccc(Cl)cc12
: