Target
Metabotropic glutamate receptor 6
Ligand
BDBM86194
Substrate
Ki
>10000±n/a nM
Comments
PDSP_2977
Citation
 Shi, QSavage, JEHufeisen, SJRauser, LGrajkowska, EErnsberger, PWroblewski, JTNadeau, JHRoth, BL L-homocysteine sulfinic acid and other acidic homocysteine derivatives are potent and selective metabotropic glutamate receptor agonists. J Pharmacol Exp Ther 305:131-42 (2003)  
Target
Name:
Metabotropic glutamate receptor 6
Synonyms:
GRM6_RAT Grm6 Metabotropic glutamate receptor 6 (mGlu6) mGlu6 | metabotropic glutamate 6
Type:
Enzyme
Mol. Mass.:
95095.82
Organism:
Rattus norvegicus (Rat)
Description:
P35349
Residue:
871
  
Inhibitor
Name:
BDBM86194
Synonyms:
CAS_109 NSC_109
Type:
Small organic molecule
Emp. Form.:
C3H7NO4S
Mol. Mass.:
153.157
SMILES:
NC(CS(O)=O)C(O)=O
: