Target
Kappa-type opioid receptor
Ligand
BDBM86252
Substrate
Ki
>10000±n/a nM
Comments
PDSP_3170
Citation
 Neal, CROwens, CETaylor, LPHoversten, MTAkil, HWatson, SJ Binding and GTPgammaS autoradiographic analysis of preproorphanin precursor peptide products at the ORL1 and opioid receptors. J Chem Neuroanat 25:233-47 (2003)  
Target
Name:
Kappa-type opioid receptor
Synonyms:
KOR-1 OPIATE Kappa Opioid receptor Ror-d
Type:
G Protein-Coupled Receptor (GPCR)
Mol. Mass.:
42692.90
Organism:
Rattus norvegicus (rat)
Description:
P34975
Residue:
380
  
Inhibitor
Name:
BDBM86252
Synonyms:
CAS_0 OFQ II 1-28
Type:
Small organic molecule
Emp. Form.:
C146H235N49O42S2
Mol. Mass.:
3412.861
SMILES:
CSCC[C@@H](NC(=O)[C@@H](CO)NC(=O)[C@@H](CC(C)C)NC(=O)[C@H](NC(=O)[C@@H](CC(C)C)NC(=O)[C@@H](Cc1ccc(O)cc1)NC(=O)[C@@H](CCC(N)=O)NC(=O)[C@@H](CCCN=C(N)N)NC(=O)[C@H](CCSC)NC(=O)[C@H](Cc1ccccc1)NC(=O)[C@H](CCC(O)=O)NC(=O)[C@@H](CO)NC(=O)[C@@H](N)Cc1ccccc1)C(C)C)C(=O)N[C@H](CCC(N)=O)C(=O)N[C@H](CO)C(=O)N[C@H](CO)C(=O)N[C@H](CCC(N)=O)C(=O)N[C@H](CCCN=C(N)N)C(=O)N[C@H](CCCN=C(N)N)C(=O)N[C@H](CCCN=C(N)N)C(=O)N[C@H](C(C)O)C(=O)N[C@H](CC(C)C)C(=O)N[C@H](Cc1cnc[nH]1)C(=O)N[C@H](CCC(N)=O)C(=O)N[C@H](CC(N)=O)C(=O)NCC(=O)N[C@H](CC(N)=O)C(=O)N[C@H](C(C)C)C(N)=O
: